Webs sample building fail

What do these errors mean, it appears in the log file when I built the Web-Sample?

Start building OCCT for wasm
Generation time: 00:01:20
The command line is too long.
mingw32-make[2]: *** [src\TKTopAlgo\CMakeFiles\TKTopAlgo.dir\build.make:4119: lin32/clang/lib/libTKTopAlgo.a] Error 1
mingw32-make[1]: *** [CMakeFiles\Makefile2:470: src/TKTopAlgo/CMakeFiles/TKTopAlgo.dir/all] Error 2
mingw32-make[1]: *** Waiting for unfinished jobs....
The command line is too long.
mingw32-make[2]: *** [src\TKMath\CMakeFiles\TKMath.dir\build.make:5739: lin32/clang/lib/libTKMath.a] Error 1
mingw32-make[1]: *** [CMakeFiles\Makefile2:140: src/TKMath/CMakeFiles/TKMath.dir/all] Error 2
The command line is too long.
mingw32-make[2]: *** [src\TKGeomBase\CMakeFiles\TKGeomBase.dir\build.make:7683: lin32/clang/lib/libTKGeomBase.a] Error 1
mingw32-make[1]: *** [CMakeFiles\Makefile2:305: src/TKGeomBase/CMakeFiles/TKGeomBase.dir/all] Error 2
The command line is too long.
mingw32-make[2]: *** [src\TKBool\CMakeFiles\TKBool.dir\build.make:6819: lin32/clang/lib/libTKBool.a] Error 1
mingw32-make[1]: *** [CMakeFiles\Makefile2:690: src/TKBool/CMakeFiles/TKBool.dir/all] Error 2
The command line is too long.
mingw32-make[2]: *** [src\TKGeomAlgo\CMakeFiles\TKGeomAlgo.dir\build.make:9924: lin32/clang/lib/libTKGeomAlgo.a] Error 1
mingw32-make[1]: *** [CMakeFiles\Makefile2:415: src/TKGeomAlgo/CMakeFiles/TKGeomAlgo.dir/all] Error 2
mingw32-make: *** [Makefile:127: all] Error 2

Kirill Gavrilov's picture

Windows has very short restriction on process arguments length. Try putting your development environment (OCCT, dependencies, etc.) at shorter file paths (e.g. closer to file system root C:\).

emad samni's picture

thanks for replay

I already move my files up in the files structure and the problem still appears, is there another solution to that error?

Best regards